{"text_format":"1","workbook":"xlsx","n_sheets":7,"sheets":["Guidance","Using the planner","Planner","calendarteach","no working days 2024-25","OccHols","Occ Days List"],"not_rendered":{"charts":0,"images":2,"macros":1,"external_links":1,"defined_names":31,"comments":0,"pivot_tables":0},"unopened":[],"bounds":{"document_bytes":16777216,"sheet_cells":100000,"rows_first":2000,"rows_last":500,"rows_between":2000,"halvings":0,"cell_chars":16384,"cell_head_chars":4096},"cells_cut":0,"cells_raw":0,"read":"whole","date_system":"1900"}

{"sheet":"Guidance","index":0,"n_rows":145,"n_cols":9,"rows_kept":145,"cut":false,"hidden":false,"merged":[[28,0,28,14],[97,0,97,1],[97,2,97,3],[97,4,97,5],[95,0,95,1],[95,2,95,3],[95,4,95,5],[96,0,96,1],[96,2,96,3],[96,4,96,5],[93,0,93,1],[93,2,93,3],[93,4,93,5],[94,0,94,1],[94,2,94,3],[94,4,94,5],[7,0,7,14],[9,0,9,14],[11,0,11,14],[14,0,14,1],[15,0,15,1],[18,6,18,7],[16,0,16,1],[17,0,17,1],[18,0,18,1],[15,2,15,3],[16,2,16,3],[17,2,17,3],[18,2,18,3],[24,0,24,14],[26,0,26,14],[33,0,33,14],[37,0,37,14],[14,4,14,5],[14,6,14,7],[14,2,14,3],[19,1,19,14],[22,0,22,14],[15,4,15,5],[16,4,16,5],[17,4,17,5],[18,4,18,5],[15,6,15,7],[16,6,16,7],[17,6,17,7],[56,0,56,14],[45,0,45,14],[50,0,50,14],[53,0,53,14],[35,0,35,14],[41,0,41,14],[39,0,39,14],[52,0,52,14],[54,0,54,14],[115,0,115,14],[102,0,102,14],[104,0,104,14],[106,0,106,14],[58,0,58,14],[75,0,75,14],[79,0,79,14],[84,0,84,14],[63,0,63,14],[65,0,65,14],[68,0,68,14],[66,0,66,14],[70,0,70,14],[87,0,87,1],[89,0,89,14],[91,0,91,14],[108,0,108,14],[110,0,110,14],[111,0,111,14],[113,0,113,14],[144,0,144,14],[117,0,117,14],[119,0,119,14],[121,0,121,14],[123,0,123,14],[125,0,125,14],[130,0,130,14],[131,0,131,14],[133,0,133,14],[135,0,135,14],[140,0,140,14],[142,0,142,14]]}
[" Education & Children’s Services"]
[]
[]
["TEACHER FLEXIBLE DAYS – GUIDELINES FOR SCHOOLS (2024/25)"]
[]
["1.0 Introduction"]
[]
["The Teacher of Flexible Days will be contracted to work the total number of the schools Management Relief days where a Head Teacher is class committed. The contract will specify the number of fixed and flexible days that are required to be worked over the school session. "]
[]
["All days are automatically paid therefore there will be no requirement for claims to be submitted for any management or in-service days."]
[]
["The table below demonstrates the current number of management days allocated which takes into account nursery provision. For the lower two levels of management days the TFD teacher will work one fixed day a week with the balance of hours being worked flexibly over the year. For those in the higher bracket, two days will be fixed with the balance of hours worked flexibly. The teacher will be employed for the total number of days averaged and paid in 12 equal instalments."]
[]
[]
["Number of Management Days",null,"Number of Fixed Days to be worked each week*",null,"FTE",null,"Standard average hours TFD paid per week"]
[82,null,1,null,0.42,null,14.718]
[97.5,null,1,null,0.5,null,17.5]
[108,null,2,null,0.55000000000000004,null,19.384599999999999]
[118,null,2,null,0.6,null,21.179500000000001]
["*","Number of Fixed Days to be worked each week (balance will be worked flexibly)"]
[]
[]
["Please note that the scheduled usage of a TFD should be spread evenly across the school session to ensure that if the TFD leaves there will be sufficient days remaining to cover the replacements contract.  Any shortfall of days at the end of the school session would need to be met by the school from another devolved budget and claimed for by S56. "]
[]
["Head Teachers should meet with the Teacher of Flexible Days to agree when the flexible days will be worked to provide cover over the year."]
[]
["The Planner tab must be used to ensure that the contractual commitment of the teacher is being met and to avoid over/under payments.  This will be the only record of the hours being worked; therefore the school will need to update this spreadsheet on a continual basis."]
[]
["The Teacher Flexible Days contract hours includes entitlement to non class contact time.  Therefore the working pattern of the TFD should ensure that the teacher receives their entitlement to non class contact time in line with the Working Time Agreement. "]
[]
[]
["2.0 Recruitment of Teacher of Flexible Days "]
[]
["When advertising a Teacher of Flexible Days post, the total number of days over the school session to be worked and average number of hours per week should be identified in the advert text and explained to the prospective candidates at interview. If you do not have a record of this then please contact your E&CS Primary Accountant prior to submitting recruitment information to ensure the information for each vacancy is correct."]
[]
["When a new or replacement TFD is in post please contact Finance (Primary Accountant) so that the schools devolved management relief allocation can be removed to allow for payment to be made from a central budget.  The school should set up a new Planner for the TFD.  You will find a blank copy on Arcadia: HR Policies and Procedures/Contract Information/Teacher Flexible Days Planner ."]
[]
["The HR Transactional Team will complete the new start eform after all pre-employment checkes have been successfully carried out and a start date agreed with the Head Teacher.  "]
[]
["As per SNCT handbook, a salary adjustment will be required to be done for any teacher who commences part way through the school session. The later in the school session a teacher starts the greater the adjustmet will be.  This should also be expalined to the prospective candidates at interview."]
{"$rows_left_out":106}
{"sheet":"Using the planner","index":1,"n_rows":50,"n_cols":6,"rows_kept":50,"cut":false,"hidden":false,"merged":[[47,3,47,4],[42,3,42,4],[43,3,43,4],[44,3,44,4],[45,3,45,4],[46,3,46,4]]}
[]
["Teacher - Flexible Days "]
[]
["NB:"]
["Please copy and save a copy of this planner for your own records for each individual."]
["A new copy will be required at the start of each new school session, for any new starts and when TFD changes hours."]
[]
["Planner:"]
[]
[1,"Enter the employees name, payroll number and school/academy"]
[]
[2,"Enter the contracted days for the whole school session:"]
[]
[null,"For example if the employee is to work 2.5 days per week (0.5 fte) then (2.5 X 39*) = 97.5."]
[]
[3,"The start date and end date can be amended, so if the employee is not employed for the whole school session this is used to give the total hours "]
[null,"to be worked - using start & end dates."]
[]
[4,"The days to be worked that will be fixed are selected - Fixed Day 1 and Fixed Day 2.  These days will then be highlighted in pink in the Hours Planner."]
[null,"Please note that generally if the hours are under 97.51 then there will be 1 fixed day and over 97.5 there will be two.  One of the possible exceptions to this is"]
[null,"when there is a job share in place and the number hours per week for the indiviual are low. "]
[]
[6,"The in-service allocation and in-service days this session/average daily hours and relevant occasional days are displayed."]
[]
[7,"The hours to be worked each day can then be entered in the Hours Planner"]
[]
[8,"If the employee is absent, please refer to section 3 of the planner."]
[null,"Please note that if average daily hours are used, when you enter the 4 decimal figure it will display as 2 digit figure in the hours box."]
[]
[null,"After each box you enter hours in, there is an absence recording box with a dropdown, please see example below:"]
[]
[null,null,"Monday","M","Tuesday","Tu"]
[null,null,0,null,0]
[null,null,7,"Sck",7,"Sck"]
[null,null,0,null,0]
[null,null,0,null,0]
[]
[]
[]
[null,"If the employee is absence please use the relevant absence recording box and using the dropdown select the appropriate reason code for absence as listed below."]
{"$rows_left_out":11}
{"sheet":"Planner","index":2,"n_rows":385,"n_cols":43,"rows_kept":385,"cut":false,"hidden":false,"merged":[[0,2,0,17],[3,7,3,20],[2,7,2,11],[1,2,1,14],[7,7,7,14],[4,7,4,14],[5,7,5,14],[6,7,6,14],[32,2,32,20],[31,7,31,11],[18,7,18,14],[28,3,28,18],[17,7,17,11],[17,2,17,3],[21,7,21,14],[19,7,19,14],[18,2,18,3],[19,2,19,3],[20,2,20,3],[29,3,30,18],[23,7,24,15],[15,2,15,3],[4,2,11,3],[16,7,16,11],[14,7,14,14],[13,7,13,14],[9,7,9,14],[15,7,15,14],[12,7,12,14],[11,7,11,14],[8,7,8,14],[16,2,16,3],[10,7,10,14],[13,2,13,3],[14,2,14,3]]}
[null,null,"HOURS PLANNER 2024/2025"]
[]
[]
[null,null,null,null,null,null,null,"EMPLOYEE DETAILS:"]
[null,null,"For guidance on using the spreadsheet, please click on the\"Using the planner\" tab below.",null,null,null,null,"Name",null,null,null,null,null,null,null,null,null,null,null,null," "]
[null,null,null,null,null,null,null,"Payroll Number",null,null,null,null,null,null,null,null,null,null,null,null," "]
[null,null,null,null,null,null,null,"Establishment (Academy or School)",null,null,null,null,null,null,null,null,null,null,null,null,"Arnage School"]
[]
[null,null,null,null,null,null,null,"Contracted Days - Whole Session",null,null,null,null,null,null,null,null,null,null,null,null,97.5]
[null,null,null,null,null,null,null,"Total Hours to be  Worked - Whole Session",null,null,null,null,null,null,null,null,null,null,{"$f":"U9*7","v":682.5},null,{"$f":"S10","v":682.5}]
[null,null,null,null,null,null,null,"Standard Average Hours Paid Per Week",null,null,null,null,null,null,null,null,null,null,null,null,{"$f":"(U9/39)*7","v":17.5}]
[null,null,null,null,null,null,null,"Start Date",null,null,null,null,null,null,null,null,{"$f":"VALUE(U12)","v":"2024-08-19"},{"$f":"Q12-1","v":45522},{"$f":"VALUE(Q13-Q12)+1","v":364},null,"2024-08-19"]
[null,null,null,null,null,null,null,"End Date",null,null,null,null,null,null,null,null,{"$f":"VALUE(U13)","v":"2025-08-17"},{"$f":"Q13+1","v":45887},{"$f":"IF(S12 >321,321,S12)","v":321},null,"2025-08-17"]
[null,null,"In-service Days:",null,null,null,null,"Total Hours to be  Worked - Using Start & End Dates",null,null,null,null,null,null,null,"Non contractual",{"$f":"AD204+AM385","v":126},{"$f":"VALUE(Q14/5)","v":25.2},{"$f":"S13-Q14","v":195},null,{"$f":"(U10/195)*S14","v":682.5}]
[null,null,"2024-08-19",null,null,null,null,"Fixed Day 1"]
[null,null,"2024-11-14",null,null,null,null,"Fixed Day 2 "]
[null,null,"2024-11-15"]
[null,null,"2025-02-11"]
[null,null,"2025-02-12",null,null,null,null,"In-Service Hours Allocation ",null,null,null,null,null,null,null,null,null,null,{"$f":"VALUE(U14)","v":682.5},null,{"$f":"IF(Q12 > R20,\"\",S19*0.02564)","v":17.499299999999998}]
[null,null,null,null,null,null,null,"In-Service Days Allocation",null,null,null,null,null,null,null,null,null,"2025-02-12",{"$f":"U19/7","v":2.4998999999999998},null,{"$f":"IF(Q12 > R20,\"\",S20)","v":2.4998999999999998}]
[]
[null,null,null,null,null,null,null,"Average Daily Hours (excludes fixed days) :",null,null,null,null,null,null,null,{"$f":"AQ41","v":0},{"$f":"(P22*(S14/5))","v":0},{"$f":"(S14)-Q22","v":195},{"$f":"U14-(Q22*7)","v":682.5},null,{"$f":"S22/R22","v":3.5}]
[null,null,null,null,null,null,null,null,null,null,null,null,null,null,null,null,null,null,null,null,null,null,null,null,null,null,null,null,null,null,null,null,null,null,null,null,null,null,null,null,"Sck"]
[null,null,null,null,null,null,null,"Occasional Days For The Selected School Between Start and End Dates:",null,null,null,null,null,null,null,null,null,{"$f":"VLOOKUP(U7,OccHols!$B$3:$H$175,2,FALSE)","v":"2025-02-07"},null,null,{"$f":"IF(R24 <$Q$12,\"\",IF(R24>$Q$13,\"\",R24))","v":"2025-02-07"},null,null,null,null,null,null,null,null,null,null,null,null,null,null,null,null,null,null,null,"Mat"]
[null,null,null,null,null,null,null,null,null,null,null,null,null,null,null,null,null,{"$f":"VLOOKUP(U7,OccHols!$B$3:$H$175,4,FALSE)","v":"2025-06-02"},null,null,{"$f":"IF(R25 <$Q$12,\"\",IF(R25>$Q$13,\"\",R25))","v":"2025-06-02"},null,null,null,null,null,null,null,null,null,null,null,null,null,null,null,null,null,null,null,"Psl"]
[null,null,null,null,null,null,null,null,null,null,null,null,null,null,null,null,null,null,null,null,null,null,null,null,null,null,null,null,null,null,null,null,null,null,null,null,null,null,null,null,"Oth"]
[null,null,"Instructions:"]
[null,null,null,"Please enter the number of hours actually worked in the Hours Planner below."]
[null,null,null,"If the employee is on sickness absence, on maternity leave, paid special leave or unpaid special leave:  "]
[null,null,null,"  Please refer to section 3 of the guidance.  Note fixed days are highlighted in pink.  The drop down in the column following the hours is used to record absence reasons."]
[]
[]
[null,null,"HOURS PLANNER"]
[null,null,"Week Start Date","Monday","M","Tuesday","Tu","Wednesday","W","Thursday","Th","Friday","F","Saturday","Sunday","Sickness","Special Leave - Unpaid","Special Leave - Paid","Weekly Total",null,"Hours Remaining","Comments"]
[{"$f":"VALUE(C35)","v":45523},null,"2024-08-19",0,null,0,null,0,null,0,null,0,null,0,0,{"$f":"COUNTIF(D35:L35,\"LSA\")","v":0},{"$f":"COUNTIF(D35:L35,\"LHE\")","v":0},{"$f":"COUNTIF(D35:L35,\"LSL\")","v":0},{"$f":"SUM(D35:O35)","v":0},null,{"$f":"U14-S35","v":682.5},null,null,null,"non contractual days are listed:"]
[{"$f":"VALUE(C36)","v":45530},null,{"$f":"C35+7","v":"2024-08-26"},0,null,0,null,0,null,0,null,0,null,0,0,0,{"$f":"COUNTIF(D36:L36,\"LHE\")","v":0},0,0,null,{"$f":"U35-S36","v":682.5}]
[45537,null,"2024-09-02",0,null,0,null,0,null,0,null,0,null,0,0,0,0,0,0,null,682.5,null,null,null,null,null,null,"no contractual days","formula","value",null,null,null,"occ days"]
[45544,null,"2024-09-09",0,null,0,null,0,null,0,null,0,null,0,0,0,0,0,0,null,682.5,null,null,null,"start date value",{"$f":"Q12","v":45523},null,"2024-08-24",{"$f":"IF($AB38<$Z$38,\"0\",IF($AB38<$Z$39,\"1\",\"0\"))","v":"1"},{"$f":"VALUE(AC38)","v":1},"2021-08-21","Monday",null,"School",null,null,"Numeric Dates",{"$f":"IF(AH38<>$U$7,\"0\",IF(AK38<$Z$38,\"0\",IF(AK38<$Z$39,\"1\",\"0\")))","v":"0"},{"$f":"VALUE(AL38)","v":0},null,null,"Fixed Days"]
[45551,null,"2024-09-16",0,null,0,null,0,null,0,null,0,null,0,0,0,0,0,0,null,682.5,null,null,null,"end dat + 1 value",{"$f":"R13","v":45887},null,"2024-08-25","1",{"$f":"VALUE(AC39)","v":1},"2021-08-22","Tuesday",null,"Aberchirder School",{"$f":"IF(AH39 = $U$7,\"y\",\"n\")","v":"n"},"Aberchirder School","2025-02-07","0",{"$f":"VALUE(AL39)","v":0},1,null,{"$f":"IF(U15 = \"\",0,1)","v":0},{"$f":"VALUE(AP39)","v":0}]
[45558,null,"2024-09-23",0,null,0,null,0,null,0,null,0,null,0,0,0,0,0,0,null,682.5,null,null,null,null,null,null,"2024-08-31","1",1,"2021-08-28","Wednesday",null,"Aberchirder School",{"$f":"IF(AH40 = $U$7,\"y\",\"n\")","v":"n"},"Aberchirder School","2025-06-02","0",{"$f":"VALUE(AL40)","v":0},2,null,{"$f":"IF(U16 = \"\",0,1)","v":0},{"$f":"VALUE(AP40)","v":0}]
{"$rows_left_out":346}
{"sheet":"calendarteach","index":3,"n_rows":368,"n_cols":12,"rows_kept":368,"cut":false,"hidden":true,"merged":[]}
["Calendar for ","2024/25",null,null,null,null,null,null,null,null,null,"2 Occasional days takes it to 195 (should always be 195)"]
[null,"Date","Day","Holidays/non contractual",null,"working days","Non working days ",null,null,"day","month","total days in month"]
[{"$f":"B3","v":45523},"2024-08-19","Monday",null,"August",1,null,null,null,19,1,31]
[45524,"2024-08-20","Tuesday",null,"August",1,null,null,null,20,1,31]
[45525,"2024-08-21","Wednesday",null,"August",1,null,null,null,21,1,31]
[45526,"2024-08-22","Thursday",null,"August",1,null,null,null,22,1,31]
[45527,"2024-08-23","Friday",null,"August",1,null,null,null,23,1,31]
[45528,"2024-08-24","Saturday",null,"August",null,1,null,null,24,1,31]
[45529,"2024-08-25","Sunday",null,"August"," ",1,null,null,25,1,31]
[45530,"2024-08-26","Monday",null,"August",1,null,null,null,26,1,31]
[45531,"2024-08-27","Tuesday",null,"August",1,null,null,null,27,1,31]
[45532,"2024-08-28","Wednesday",null,"August",1,null,null,null,28,1,31]
[45533,"2024-08-29","Thursday",null,"August",1,null,null,null,29,1,31]
[45534,"2024-08-30","Friday",null,"August",1,null,null,null,30,1,31]
[45535,"2024-08-31","Saturday",null,"August",null,1,null,null,31,1,31]
[45536,"2024-09-01","Sunday",null,"September",null,1,null,null,1,2,30]
[45537,"2024-09-02","Monday",null,"September",1,null,null,null,2,2,30]
[45538,"2024-09-03","Tuesday",null,"September",1,null,null,null,3,2,30]
[45539,"2024-09-04","Wednesday",null,"September",1,null,null,null,4,2,30]
[45540,"2024-09-05","Thursday",null,"September",1,null,null,null,5,2,30]
[45541,"2024-09-06","Friday",null,"September",1,null,null,null,6,2,30]
[45542,"2024-09-07","Saturday",null,"September",null,1,null,null,7,2,30]
[45543,"2024-09-08","Sunday",null,"September",null,1,null,null,8,2,30]
[45544,"2024-09-09","Monday",null,"September",1,null,null,null,9,2,30]
[45545,"2024-09-10","Tuesday",null,"September",1,null,null,null,10,2,30]
[45546,"2024-09-11","Wednesday",null,"September",1,null,null,null,11,2,30]
[45547,"2024-09-12","Thursday",null,"September",1,null,null,null,12,2,30]
[45548,"2024-09-13","Friday",null,"September",1,null,null,null,13,2,30]
[45549,"2024-09-14","Saturday",null,"September",null,1,null,null,14,2,30]
[45550,"2024-09-15","Sunday",null,"September",null,1,null,null,15,2,30]
[45551,"2024-09-16","Monday",null,"September",1,null,null,null,16,2,30]
[45552,"2024-09-17","Tuesday",null,"September",1,null,null,null,17,2,30]
[45553,"2024-09-18","Wednesday",null,"September",1,null,null,null,18,2,30]
[45554,"2024-09-19","Thursday",null,"September",1,null,null,null,19,2,30]
[45555,"2024-09-20","Friday",null,"September",1,null,null,null,20,2,30]
[45556,"2024-09-21","Saturday",null,"September",null,1,null,null,21,2,30]
[45557,"2024-09-22","Sunday",null,"September"," ",1,null,null,22,2,30]
[45558,"2024-09-23","Monday",null,"September",1,null,null,null,23,2,30]
[45559,"2024-09-24","Tuesday",null,"September",1,null,null,null,24,2,30]
[45560,"2024-09-25","Wednesday",null,"September",1,null,null,null,25,2,30]
{"$rows_left_out":329}
{"sheet":"no working days 2024-25","index":4,"n_rows":169,"n_cols":7,"rows_kept":169,"cut":false,"hidden":true,"merged":[]}
["Calendar for ","2024/25"]
[null,"Date","Day","Holidays/non contractual",null,"working days","Non working days "]
["2024-08-24","2024-08-24","Saturday",null,"August",null,1]
["2024-08-25","2024-08-25","Sunday",null,"August"," ",1]
["2024-08-31","2024-08-31","Saturday",null,"August",null,1]
["2024-09-01","2024-09-01","Sunday",null,"September",null,1]
["2024-09-07","2024-09-07","Saturday",null,"September",null,1]
["2024-09-08","2024-09-08","Sunday",null,"September",null,1]
["2024-09-14","2024-09-14","Saturday",null,"September",null,1]
["2024-09-15","2024-09-15","Sunday",null,"September",null,1]
["2024-09-21","2024-09-21","Saturday",null,"September",null,1]
["2024-09-22","2024-09-22","Sunday",null,"September"," ",1]
["2024-09-28","2024-09-28","Saturday",null,"September",null,1]
["2024-09-29","2024-09-29","Sunday",null,"September",null,1]
["2024-10-05","2024-10-05","Saturday",null,"October",null,1]
["2024-10-06","2024-10-06","Sunday",null,"October"," ",1]
["2024-10-12","2024-10-12","Saturday",null,"October",null,1]
["2024-10-13","2024-10-13","Sunday",null,"October",null,1]
["2024-10-14","2024-10-14","Monday","Hol","October",null,1]
["2024-10-15","2024-10-15","Tuesday","Hol","October",null,1]
["2024-10-16","2024-10-16","Wednesday","Hol","October",null,1]
["2024-10-17","2024-10-17","Thursday","Hol","October",null,1]
["2024-10-18","2024-10-18","Friday","Hol","October",null,1]
["2024-10-19","2024-10-19","Saturday",null,"October",null,1]
["2024-10-20","2024-10-20","Sunday",null,"October"," ",1]
["2024-10-21","2024-10-21","Monday","Hol","October",null,1]
["2024-10-22","2024-10-22","Tuesday","Hol","October",null,1]
["2024-10-23","2024-10-23","Wednesday","NC","October",null,1]
["2024-10-24","2024-10-24","Thursday","NC","October",null,1]
["2024-10-25","2024-10-25","Friday","NC","October",null,1]
["2024-10-26","2024-10-26","Saturday",null,"October",null,1]
["2024-10-27","2024-10-27","Sunday",null,"October",null,1]
["2024-11-02","2024-11-02","Saturday",null,"November",null,1]
["2024-11-03","2024-11-03","Sunday",null,"November"," ",1]
["2024-11-09","2024-11-09","Saturday",null,"November",null,1]
["2024-11-10","2024-11-10","Sunday",null,"November",null,1]
["2024-11-16","2024-11-16","Saturday",null,"November",null,1]
["2024-11-17","2024-11-17","Sunday",null,"November"," ",1]
["2024-11-23","2024-11-23","Saturday",null,"November",null,1]
["2024-11-24","2024-11-24","Sunday",null,"November",null,1]
{"$rows_left_out":130}
{"sheet":"OccHols","index":5,"n_rows":175,"n_cols":8,"rows_kept":175,"cut":false,"hidden":true,"merged":[]}
[null,"OCCASIONAL DAYS 2024-2025"]
["CSN","NO SCHOOL","Date","Numeric Date","Date","Numeric Date","Day1","Day2"]
["Banff","Aberchirder School","2025-02-07",45695,"2025-06-02",45810,"Friday","Monday"]
["Aboyne","Aboyne Academy","2025-02-06",45694,"2025-02-07",45695,"Thursday","Friday"]
["Aboyne","Aboyne School","2025-02-06",45694,"2025-02-07",45695,"Thursday","Friday"]
["Kemnay","Alehousewells School","2025-02-07",45695,"2025-06-02",45810,"Friday","Monday"]
["Alford","Alford Academy","2025-02-07",45695,"2025-06-02",45810,"Friday","Monday"]
["Alford","Alford School","2025-02-07",45695,"2025-06-02",45810,"Friday","Monday"]
["Peterhead","Anna Ritchie School","2025-02-07",45695,"2025-06-02",45810,"Friday","Monday"]
["Stonehaven","Arduthie School","2025-02-07",45695,"2025-06-02",45810,"Friday","Monday"]
["Ellon","Arnage School","2025-02-07",45695,"2025-06-02",45810,"Friday","Monday"]
["Mearns","Auchenblae School","2025-02-06",45694,"2025-02-07",45695,"Thursday","Friday"]
["Mintlaw","Auchnagatt School","2025-02-07",45695,"2025-06-02",45810,"Friday","Monday"]
["Ellon","Auchterellon School","2025-02-07",45695,"2025-06-02",45810,"Friday","Monday"]
["Turriff","Auchterless School","2025-02-07",45695,"2025-06-02",45810,"Friday","Monday"]
["Aboyne","Ballater School","2025-02-06",45694,"2025-02-07",45695,"Thursday","Friday"]
["Ellon","Balmedie School  ","2025-02-07",45695,"2025-06-02",45810,"Friday","Monday"]
["Banchory","Banchory Academy","2025-02-07",45695,"2025-06-02",45810,"Friday","Monday"]
["Banchory","Banchory School","2025-02-07",45695,"2025-06-02",45810,"Friday","Monday"]
["Portlethen","Banchory-Devenick Sch.","2025-02-06",45694,"2025-02-07",45695,"Thursday","Friday"]
["Banff","Banff  School","2025-02-07",45695,"2025-06-02",45810,"Friday","Monday"]
["Banff","Banff Academy","2025-02-07",45695,"2025-06-02",45810,"Friday","Monday"]
["Meldrum","Barthol Chapel School","2025-02-07",45695,"2025-06-02",45810,"Friday","Monday"]
["Stonehaven","Bervie School","2025-02-07",45695,"2025-06-02",45810,"Friday","Monday"]
["Peterhead","Boddam School","2025-02-07",45695,"2025-06-02",45810,"Friday","Monday"]
["Banff","Bracoden School","2025-02-07",45695,"2025-06-02",45810,"Friday","Monday"]
["Aboyne","Braemar School","2025-02-06",45694,"2025-02-07",45695,"Thursday","Friday"]
["Peterhead","Buchanhaven School","2025-02-07",45695,"2025-06-02",45810,"Friday","Monday"]
["Peterhead","Burnhaven School","2025-02-07",45695,"2025-06-02",45810,"Friday","Monday"]
["Huntly","Cairney School","2025-02-07",45695,"2025-06-02",45810,"Friday","Monday"]
["Stonehaven","Carronhill School","2025-02-07",45695,"2025-06-02",45810,"Friday","Monday"]
["Stonehaven","Catterline School","2025-02-07",45695,"2025-06-02",45810,"Friday","Monday"]
["Inverurie","Chapel of Garioch School","2025-02-07",45695,"2025-06-02",45810,"Friday","Monday"]
["Huntly","Clatt School","2025-02-07",45695,"2025-06-02",45810,"Friday","Monday"]
["Peterhead","Clerkhill School","2025-02-07",45695,"2025-06-02",45810,"Friday","Monday"]
["Alford","Cluny School","2025-02-07",45695,"2025-06-02",45810,"Friday","Monday"]
["Alford","Craigievar School","2025-02-07",45695,"2025-06-02",45810,"Friday","Monday"]
["Banchory","Crathes School","2025-02-07",45695,"2025-06-02",45810,"Friday","Monday"]
["Aboyne","Crathie School","2025-02-06",45694,"2025-02-07",45695,"Thursday","Friday"]
["Fraserburgh","Crimond School","2025-02-07",45695,"2025-06-02",45810,"Friday","Monday"]
{"$rows_left_out":136}
{"sheet":"Occ Days List","index":6,"n_rows":347,"n_cols":3,"rows_kept":347,"cut":false,"hidden":true,"merged":[]}
["NO SCHOOL","Date","Numeric Date"]
["Aberchirder School","2025-02-07",45695]
["Aberchirder School","2025-06-02",45810]
["Aboyne Academy","2025-02-06",45694]
["Aboyne Academy","2025-02-07",45695]
["Aboyne School","2025-02-06",45694]
["Aboyne School","2025-02-07",45695]
["Alehousewells School","2025-02-07",45695]
["Alehousewells School","2025-06-02",45810]
["Alford Academy","2025-02-07",45695]
["Alford Academy","2025-06-02",45810]
["Alford School","2025-02-07",45695]
["Alford School","2025-06-02",45810]
["Anna Ritchie School","2025-02-07",45695]
["Anna Ritchie School","2025-06-02",45810]
["Arduthie School","2025-02-07",45695]
["Arduthie School","2025-06-02",45810]
["Arnage School","2025-02-07",45695]
["Arnage School","2025-06-02",45810]
["Auchenblae School","2025-02-06",45694]
["Auchenblae School","2025-02-07",45695]
["Auchnagatt School","2025-02-07",45695]
["Auchnagatt School","2025-06-02",45810]
["Auchterellon School","2025-02-07",45695]
["Auchterellon School","2025-06-02",45810]
["Auchterless School","2025-02-07",45695]
["Auchterless School","2025-06-02",45810]
["Ballater School","2025-02-06",45694]
["Ballater School","2025-02-07",45695]
["Balmedie School  ","2025-02-07",45695]
["Balmedie School  ","2025-06-02",45810]
["Banchory Academy","2025-02-07",45695]
["Banchory Academy","2025-06-02",45810]
["Banchory School","2025-02-07",45695]
["Banchory School","2025-06-02",45810]
["Banchory-Devenick Sch.","2025-02-06",45694]
["Banchory-Devenick Sch.","2025-02-07",45695]
["Banff  School","2025-02-07",45695]
["Banff  School","2025-06-02",45810]
["Banff Academy","2025-02-07",45695]
{"$rows_left_out":307}